Errors on a patcher

hi there, I have a patch that works as it should, but as soon as i move everything to a patcher,
i get a lot of error messages when trying to put it live,
i’m a little lost

Generate code complete
Compiling patch.
/Users/Pauk/Library/Akso/build/xpatch.cpp:317:1: error: ‘braids_deriv’ does not name a type; did you mean ‘braids’?
braids_deriv::SineFold osc;
^~~~~~~~~~~~
braids
/Users/Pauk/Library/Akso/build/xpatch.cpp: In member function ‘void rootc::instancepatcher__1::instancesinefold__1::Init(rootc::instancepatcher__1*)’:
/Users/Pauk/Library/Akso/build/xpatch.cpp:319:1: error: ‘osc’ was not declared in this scope
osc.Init();
^~~
/Users/Pauk/Library/Akso/build/xpatch.cpp:319:1: note: suggested alternative: ‘cosl’
osc.Init();
^~~
cosl
/Users/Pauk/Library/Akso/build/xpatch.cpp: In member function ‘void rootc::instancepatcher__1::instancesinefold__1::dsp(rootc::instancepatcher__1*, int32_t, int32_t, int32_t (&)[16], int, int)’:
/Users/Pauk/Library/Akso/build/xpatch.cpp:330:1: error: ‘osc’ was not declared in this scope
osc.set_parameter(__USAT((inlet_timbre+param_timbre)>>12,15));
^~~
/Users/Pauk/Library/Akso/build/xpatch.cpp:330:1: note: suggested alternative: ‘cosl’
osc.set_parameter(__USAT((inlet_timbre+param_timbre)>>12,15));
^~~
cosl
/Users/Pauk/Library/Akso/build/xpatch.cpp: In member function ‘void rootc::instancepatcher__1::instanceobj__3::instancerectifier__1::Init(rootc::instancepatcher__1::instanceobj__3*)’:
/Users/Pauk/Library/Akso/build/xpatch.cpp:2576:18: error: ‘blt’ was not declared in this scope
oscp[j] = &blt[BLEPSIZE-1];
^~~
/Users/Pauk/Library/Akso/build/xpatch.cpp:2576:18: note: suggested alternative: ‘blept’
oscp[j] = &blt[BLEPSIZE-1];
^~~
blept
/Users/Pauk/Library/Akso/build/xpatch.cpp: In member function ‘void rootc::instancepatcher__1::instanceobj__3::instancerectifier__1::dsp(rootc::instancepatcher__1::instanceobj__3*, const int32_t*, int32_t (&)[16])’:
/Users/Pauk/Library/Akso/build/xpatch.cpp:2590:30: error: ‘blt’ was not declared in this scope
const int16_t lastblep = &blt[BLEPSIZE-1];
^~~
/Users/Pauk/Library/Akso/build/xpatch.cpp:2590:30: note: suggested alternative: ‘blept’
const int16_t lastblep = &blt[BLEPSIZE-1];
^~~
blept
/Users/Pauk/Library/Akso/build/xpatch.cpp: In member function 'void rootc::instancepatcher__1::instanceobj__3::instancerectifier__2::Init(rootc::instancepatcher__1::instanceobj__3
)’:
/Users/Pauk/Library/Akso/build/xpatch.cpp:2699:18: error: ‘blt’ was not declared in this scope
oscp[j] = &blt[BLEPSIZE-1];
^~~
/Users/Pauk/Library/Akso/build/xpatch.cpp:2699:18: note: suggested alternative: ‘blept’
oscp[j] = &blt[BLEPSIZE-1];
^~~
blept
/Users/Pauk/Library/Akso/build/xpatch.cpp: In member function 'void rootc::instancepatcher__1::instanceobj__3::instancerectifier__2::dsp(rootc::instancepatcher__1::instanceobj__3
, const int32_t*, int32_t (&)[16])’:
/Users/Pauk/Library/Akso/build/xpatch.cpp:2713:30: error: ‘blt’ was not declared in this scope
const int16_t *lastblep = &blt[BLEPSIZE-1];
^~~
/Users/Pauk/Library/Akso/build/xpatch.cpp:2713:30: note: suggested alternative: ‘blept’
const int16_t *lastblep = &blt[BLEPSIZE-1];
^~~
blept
make: *** [/Users/Pauk/Library/Akso/build/xpatch.o] Error 1
shell task failed, exit value: 2
Compiling patch failed.
axoloti.shell.ExecutionFailedException
axoloti.shell.ExecutionFailedException
at axoloti.shell.ShellTask.run(ShellTask.java:120)
at axoloti.shell.ShellTask.lambda$getJob$0(ShellTask.java:37)
at axoloti.shell.CompilePatch.lambda$run$0(CompilePatch.java:67)
at java.base/java.lang.Thread.run(Thread.java:834)

axoloti.shell.ExecutionFailedException
axoloti.shell.ExecutionFailedException
at axoloti.shell.CompilePatch.run(CompilePatch.java:75)
at axoloti.live.patch.PatchViewLive.lambda$goLive$7(PatchViewLive.java:275)
at axoloti.job.JobProcessor.lambda$exec$0(JobProcessor.java:21)
at java.base/java.util.concurrent.ThreadPoolExecutor.runWorker(ThreadPoolExecutor.java:1128)
at java.base/java.util.concurrent.ThreadPoolExecutor$Worker.run(ThreadPoolExecutor.java:628)
at java.base/java.lang.Thread.run(Thread.java:834)

If I recall, there are some compatibility issues with the Mutable modules.

Are other patches working for you?

Hi joshua,
Yes almost everything looks to work
I dont’t know, the module is working if i don’t put it in a patcher,
I’m also using a mutable reverb that works pretty well.
Right now it 's just that module inside a patcher.

Geez, I dunno. Sorry! I’m in the middle of another project right now and can’t try to replicate the issue.